Kodi Community Forum

Full Version: Error while compiling xbmc 11.0
You're currently viewing a stripped down version of our content. View the full version with proper formatting.
Hi ,

I am trying to compile xbmc-11 in open embedded based poky platform builder ,on ubuntu 10.10 32 bit host machine ,
Fetching xbmc source from http://mirrors.xbmc.org/releases/source/...1.0.tar.gz
Getting the following error :

| make -C lib/cpluff/libcpluff
| make[1]: Entering directory `/home/work/xbmc/poky_xbmc/build/tmp/work/atom-poky-linux/xbmc-11.1-r0/xbmc-11.0/lib/cpluff/libcpluff'
| Making all in docsrc
| make[2]: Entering directory `/home/work/xbmc/poky_xbmc/build/tmp/work/atom-poky-linux/xbmc-11.1-r0/xbmc-11.0/lib/cpluff/libcpluff/docsrc'
| make[2]: Nothing to be done for `all'.
| make[2]: Leaving directory `/home/work/xbmc/poky_xbmc/build/tmp/work/atom-poky-linux/xbmc-11.1-r0/xbmc-11.0/lib/cpluff/libcpluff/docsrc'
| make[2]: Entering directory `/home/work/xbmc/poky_xbmc/build/tmp/work/atom-poky-linux/xbmc-11.1-r0/xbmc-11.0/lib/cpluff/libcpluff'
| /bin/sh ../../../-libtool --tag=CC --mode=compile i586-poky-linux-gcc -m32 -march=core2 -msse3 -mtune=generic -mfpmath=sse --sysroot=/home/work/xbmc/poky_xbmc/build/tmp/sysroots/fishriver -DHAVE_CONFIG_H -I. -I.. -I.. -I../libcpluff -I../libcpluff -DNDEBUG -I. -DCP_C_API=CP_EXPORT -DCP_HOST="\"i686-pc-linux-gnu\"" -DCP_DATADIR="\"/usr/local/share\"" -I/homework/xbmc/poky_xbmc/build/tmp/sysroots/fishriver/usr/include/python2.6 -I/home/work/xbmc/poky_xbmc/build/tmp/sysroots/fishriver/usr/include -fPIC -DPIC -D_REENTRANT -D_LARGEFILE64_SOURCE -D_FILE_OFFSET_BITS=64 -g -D_DEBUG -Wall -O2 -MT psymbol.lo -MD -MP -MF .deps/psymbol.Tpo -c -o psymbol.lo psymbol.c
| mv -f .deps/psymbol.Tpo .deps/psymbol.Plo
| mv: cannot stat `.deps/psymbol.Tpo': No such file or directory
| make[2]: *** [psymbol.lo] Error 1
| make[2]: Leaving directory `/home/work/xbmc/poky_xbmc/build/tmp/work/atom-poky-linux/xbmc-11.1-r0/xbmc-11.0/lib/cpluff/libcpluff'
| make[1]: *** [all-recursive] Error 1
| make[1]: Leaving directory `/home/work/xbmc/poky_xbmc/build/tmp/work/atom-poky-linux/xbmc-11.1-r0/xbmc-11.0/lib/cpluff/libcpluff'
| make: *** [lib/cpluff/libcpluff/.libs/libcpluff.a] Error 2
| make: *** Waiting for unfinished jobs....
| FATAL: oe_runmake failed
| ERROR: Function 'do_compile' failed (see /home/work/xbmc/poky_xbmc/build/tmp/work/atom-poky-linux/xbmc-11.1-r0/temp/log.do_compile.22558 for further information)
NOTE: package xbmc-11.1-r0: task do_compile: Failed


After analysis , it is trying to search psymbol.Tpo in xbmc-11.0/lib/cpluff/libcpluff . In this directory psymbol.Tpo is not present so showing this error .
Please help me out how to generate this file in the above said path
Any suggestion or guidance would be realy appreciated


Thanks in advance
Chinmaya H