Android Error while compiling xbmc for android on Ubuntu 12.04, 32bit machine
#11
Terminal output of my error while building dependencies is shown below. Please refer to it and tell me what i am doing wrong.

...
changing mode of /home/vijeesh/install/i686-linux-gnu-native/lib/python2.6/lib-dynload/dl.so to 755
changing mode of /home/vijeesh/install/i686-linux-gnu-native/lib/python2.6/lib-dynload/ to 755
error: /home/vijeesh/install/i686-linux-gnu-native/lib/python2.6/lib-dynload/: Operation not permitted
make[3]: *** [sharedinstall] Error 1
make[3]: Leaving directory `/home/vijeesh/xbmc-android/tools/depends/native/python26-native/i686-linux-gnu-native'
make[2]: *** [.installed-i686-linux-gnu-native] Error 2
make[2]: Leaving directory `/home/vijeesh/xbmc-android/tools/depends/native/python26-native'
make[1]: *** [python26-native] Error 2
make[1]: Leaving directory `/home/vijeesh/xbmc-android/tools/depends/native'
make: *** [native/.installed-i686-linux-gnu-native] Error 2
Reply


Messages In This Thread
RE: Error while compiling xbmc for android on Ubuntu 12.04, 32bit machine - by Vijeesh - 2013-06-17, 11:43


Logout Mark Read Team Forum Stats Members Help
Error while compiling xbmc for android on Ubuntu 12.04, 32bit machine0
This forum uses Lukasz Tkacz MyBB addons.